Target
[Pyruvate dehydrogenase (acetyl-transferring)] kinase isozyme 2, mitochondrial
Ligand
BDBM414877
Substrate
Meas. Tech.
Biochemical Activity Assay
IC50
3900±n/a nM
Citation
 Buchstaller, H Piperidinyl derivatives US Patent  US10428024 Publication Date 10/1/2019 
Target
Name:
[Pyruvate dehydrogenase (acetyl-transferring)] kinase isozyme 2, mitochondrial
Synonyms:
PDHK2 PDK2_HUMAN Pyruvate dehydrogenase kinase isoenzyme 1 (PDK2)
Type:
Enzyme
Mol. Mass.:
46153.78
Organism:
Homo sapiens (Human)
Description:
Q15119
Residue:
407
  
Inhibitor
Name:
BDBM414877
Synonyms:
4-Chloro-2-fluoro-N-methyl-N-[(3S,4R)-3-methyl-1-[(2R)-3,3,3-trifluoro-2-hydroxy-2-methylpropanoyl]piperidin-4-yl]benzamide | US10428024, Compound A60
Type:
Small organic molecule
Emp. Form.:
C18H21ClF4N2O3
Mol. Mass.:
424.818
SMILES:
C[C@H]1CN(CC[C@H]1N(C)C(=O)c1ccc(Cl)cc1F)C(=O)[C@@](C)(O)C(F)(F)F
: