Target
[Pyruvate dehydrogenase (acetyl-transferring)] kinase isozyme 2, mitochondrial
Ligand
BDBM414882
Substrate
Meas. Tech.
Biochemical Activity Assay
IC50
2100±n/a nM
Citation
 Buchstaller, H Piperidinyl derivatives US Patent  US10428024 Publication Date 10/1/2019 
Target
Name:
[Pyruvate dehydrogenase (acetyl-transferring)] kinase isozyme 2, mitochondrial
Synonyms:
PDHK2 PDK2_HUMAN Pyruvate dehydrogenase kinase isoenzyme 1 (PDK2)
Type:
Enzyme
Mol. Mass.:
46153.78
Organism:
Homo sapiens (Human)
Description:
Q15119
Residue:
407
  
Inhibitor
Name:
BDBM414882
Synonyms:
4-Cyano-N-ethyl-N-[1-((R)-3,3,3-trifluoro-2-hydroxy-2-methyl-propionyl)-piperidin-4-yl]-benzamide | US10428024, Compound A66
Type:
Small organic molecule
Emp. Form.:
C19H22F3N3O3
Mol. Mass.:
397.3915
SMILES:
CCN(C1CCN(CC1)C(=O)[C@@](C)(O)C(F)(F)F)C(=O)c1ccc(cc1)C#N
: