Target
Histone deacetylase 2
Ligand
BDBM414886
Substrate
Meas. Tech.
Enzyme Inhibition
IC50
<1000±n/a nM
Citation
 Jacques, VRusche, JR HDAC inhibitors US Patent  US10428028 Publication Date 10/1/2019 
Target
Name:
Histone deacetylase 2
Synonyms:
Cereblon/Histone deacetylase 2 HDAC2 Histone deacetylase 2 (HDAC2) | Human HDAC2
Type:
Chromatin regulator; hydrolase; repressor
Mol. Mass.:
55356.54
Organism:
Homo sapiens (Human)
Description:
Q92769
Residue:
488
  
Inhibitor
Name:
BDBM414886
Synonyms:
US10428028, Coding A2
Type:
Small organic molecule
Emp. Form.:
C21H18N4O
Mol. Mass.:
342.3938
SMILES:
Nc1ccccc1NC(=O)c1ccc2n(Cc3ccccc3)ncc2c1
: