Target
Histone deacetylase 3
Ligand
BDBM414892
Substrate
Meas. Tech.
Enzyme Inhibition
IC50
<1000±n/a nM
Citation
 Jacques, VRusche, JR HDAC inhibitors US Patent  US10428028 Publication Date 10/1/2019 
Target
Name:
Histone deacetylase 3
Synonyms:
HD3 HDAC3_HUMAN Human HDAC3 SMAP45
Type:
Enzyme
Mol. Mass.:
48829.55
Organism:
Homo sapiens (Human)
Description:
O15379
Residue:
428
  
Inhibitor
Name:
BDBM414892
Synonyms:
US10428028, Coding A8
Type:
Small organic molecule
Emp. Form.:
C22H20FN5O
Mol. Mass.:
389.4255
SMILES:
Cc1ccc(Cn2ncc3cc(ccc23)C(=O)Nc2ccc(F)cc2N)c(C)n1
: