Target
Histone deacetylase 3
Ligand
BDBM414896
Substrate
Meas. Tech.
Enzyme Inhibition
IC50
<1000±n/a nM
Citation
 Jacques, VRusche, JR HDAC inhibitors US Patent  US10428028 Publication Date 10/1/2019 
Target
Name:
Histone deacetylase 3
Synonyms:
HD3 HDAC3_HUMAN Human HDAC3 SMAP45
Type:
Enzyme
Mol. Mass.:
48829.55
Organism:
Homo sapiens (Human)
Description:
O15379
Residue:
428
  
Inhibitor
Name:
BDBM414896
Synonyms:
US10428028, Coding A12
Type:
Small organic molecule
Emp. Form.:
C18H17FN4O
Mol. Mass.:
324.3522
SMILES:
Nc1cc(F)ccc1NC(=O)c1ccc2n(CC3CC3)ncc2c1
: