Target
Mitotic checkpoint serine/threonine-protein kinase BUB1
Ligand
BDBM415330
Substrate
Meas. Tech.
Kinase Assay
IC50
5.05±n/a nM
Citation
 Graham, KKlar, UBriem, HHitchcock, MBärfacker, LEis, KSchulze, VSiemeister, GBone, WSchröder, JHolton, SLienau, PTempel, RSonnenschein, HBálint, JGraubaum, H 3-amino-1,5,6,7-tetrahydro-4H-indol-4-ones US Patent  US10428044 Publication Date 10/1/2019 
Target
Name:
Mitotic checkpoint serine/threonine-protein kinase BUB1
Synonyms:
BUB1 BUB1L hBUB1
Type:
PROTEIN
Mol. Mass.:
122372.31
Organism:
Homo sapiens (Human)
Description:
ChEMBL_1510603
Residue:
1085
  
Inhibitor
Name:
BDBM415330
Synonyms:
Preparation of 6-(chloromethyl)-3-(phenylamino)-2-(pyridin-4-yl)-1,5,6,7-tetrahydro-4H-indol-4-one | US10428044, Example 443
Type:
Small organic molecule
Emp. Form.:
C20H18ClN3O
Mol. Mass.:
351.829
SMILES:
ClCC1Cc2[nH]c(c(Nc3ccccc3)c2C(=O)C1)-c1ccncc1
: