Target
Mitotic checkpoint serine/threonine-protein kinase BUB1
Ligand
BDBM415348
Substrate
Meas. Tech.
Kinase Assay
IC50
6.88±n/a nM
Citation
 Graham, KKlar, UBriem, HHitchcock, MBärfacker, LEis, KSchulze, VSiemeister, GBone, WSchröder, JHolton, SLienau, PTempel, RSonnenschein, HBálint, JGraubaum, H 3-amino-1,5,6,7-tetrahydro-4H-indol-4-ones US Patent  US10428044 Publication Date 10/1/2019 
Target
Name:
Mitotic checkpoint serine/threonine-protein kinase BUB1
Synonyms:
BUB1 BUB1L hBUB1
Type:
PROTEIN
Mol. Mass.:
122372.31
Organism:
Homo sapiens (Human)
Description:
ChEMBL_1510603
Residue:
1085
  
Inhibitor
Name:
BDBM415348
Synonyms:
Preparation of N-{4-[6-(fluoromethyl)-4-oxo-3-(phenylamino)-4,5,6,7-tetrahydro-1H-indol-2-yl]pyridin-2-yl}acetamide | US10428044, Example 461
Type:
Small organic molecule
Emp. Form.:
C22H21FN4O2
Mol. Mass.:
392.4261
SMILES:
CC(=O)Nc1cc(ccn1)-c1[nH]c2CC(CF)CC(=O)c2c1Nc1ccccc1
: