Target
Mitotic checkpoint serine/threonine-protein kinase BUB1
Ligand
BDBM415364
Substrate
Meas. Tech.
Kinase Assay
IC50
6.62±n/a nM
Citation
 Graham, KKlar, UBriem, HHitchcock, MBärfacker, LEis, KSchulze, VSiemeister, GBone, WSchröder, JHolton, SLienau, PTempel, RSonnenschein, HBálint, JGraubaum, H 3-amino-1,5,6,7-tetrahydro-4H-indol-4-ones US Patent  US10428044 Publication Date 10/1/2019 
Target
Name:
Mitotic checkpoint serine/threonine-protein kinase BUB1
Synonyms:
BUB1 BUB1L hBUB1
Type:
PROTEIN
Mol. Mass.:
122372.31
Organism:
Homo sapiens (Human)
Description:
ChEMBL_1510603
Residue:
1085
  
Inhibitor
Name:
BDBM415364
Synonyms:
Preparation of N-{4-[6,6-dimethyl-4-oxo-3-(phenylamino)-4,5,6,7-tetrahydro-1H-indol-2-yl]pyridin-2-yl}-2,2-difluorocyclopropanecarboxamide | US10428044, Example 477
Type:
Small organic molecule
Emp. Form.:
C25H24F2N4O2
Mol. Mass.:
450.4805
SMILES:
CC1(C)Cc2[nH]c(c(Nc3ccccc3)c2C(=O)C1)-c1ccnc(NC(=O)C2CC2(F)F)c1
: