Target
Mitotic checkpoint serine/threonine-protein kinase BUB1
Ligand
BDBM415379
Substrate
Meas. Tech.
Kinase Assay
IC50
5.28±n/a nM
Citation
 Graham, KKlar, UBriem, HHitchcock, MBärfacker, LEis, KSchulze, VSiemeister, GBone, WSchröder, JHolton, SLienau, PTempel, RSonnenschein, HBálint, JGraubaum, H 3-amino-1,5,6,7-tetrahydro-4H-indol-4-ones US Patent  US10428044 Publication Date 10/1/2019 
Target
Name:
Mitotic checkpoint serine/threonine-protein kinase BUB1
Synonyms:
BUB1 BUB1L hBUB1
Type:
PROTEIN
Mol. Mass.:
122372.31
Organism:
Homo sapiens (Human)
Description:
ChEMBL_1510603
Residue:
1085
  
Inhibitor
Name:
BDBM415379
Synonyms:
Preparation of N-{4-[4-oxo-3-(phenylamino)-4,5,6,7-tetrahydro-1H-indol-2-yl]pyridin-2-yl}-2-(pyridin-3-ylmethoxy)acetamide | US10428044, Example 492
Type:
Small organic molecule
Emp. Form.:
C29H29N5O3
Mol. Mass.:
495.5723
SMILES:
CC1(C)Cc2[nH]c(c(Nc3ccccc3)c2C(=O)C1)-c1ccnc(NC(=O)COCc2cccnc2)c1
: