Target
Mitotic checkpoint serine/threonine-protein kinase BUB1 [704-1085]
Ligand
BDBM415431
Substrate
Meas. Tech.
Kinase Assay
IC50
9.93±n/a nM
Citation
 Graham, KKlar, UBriem, HSchulze, VSiemeister, GLienau, PTempel, RBálint, J 4H-pyrrolo[3,2-C]pyridin-4-one derivatives US Patent  US10428063 Publication Date 10/1/2019 
Target
Name:
Mitotic checkpoint serine/threonine-protein kinase BUB1 [704-1085]
Synonyms:
BUB1 BUB1_HUMAN | Mitotic checkpoint serine/threonine-protein kinase BUB1 (aa 704-1085)
Type:
Mol. Mass.:
43624.72
Organism:
Homo sapiens (Human)
Description:
O43683[704-1085]
Residue:
382
  
Inhibitor
Name:
BDBM415431
Synonyms:
2-[3-(2-methoxyethoxy)pyridin-4-yl]-5-methyl-3-(phenylamino)-1,5,6,7-tetrahydro-4H-pyrrolo[3,2-c]pyridin-4-one | US10428063, Example 31
Type:
Small organic molecule
Emp. Form.:
C22H24N4O3
Mol. Mass.:
392.451
SMILES:
COCCOc1cnccc1-c1[nH]c2CCN(C)C(=O)c2c1Nc1ccccc1
: