Target
Tyrosine-protein kinase JAK1
Ligand
BDBM260458
Substrate
Meas. Tech.
In vitro kinase assay
IC50
80.0±n/a nM
Citation
 Zhang, XDong, QLiu, BZhu, YLi, XLan, J Pyrrole heteroaryl ring derivative and method of use thereof US Patent  US10428074 Publication Date 10/1/2019 
Target
Name:
Tyrosine-protein kinase JAK1
Synonyms:
JAK-1 JAK1A JAK1_HUMAN Janus kinase 1 (JAK1) | Janus kinase 1 JAK1
Type:
Protein
Mol. Mass.:
133293.73
Organism:
Homo sapiens (Human)
Description:
P23458
Residue:
1154
  
Inhibitor
Name:
BDBM260458
Synonyms:
US10428074, Example 15 US9527851, example 15
Type:
Small organic molecule
Emp. Form.:
C17H23N5O2S
Mol. Mass.:
361.462
SMILES:
CN([C@@H]1C[C@H]2CN(C[C@H]2C1)S(=O)(=O)C1CC1)c1ncnc2[nH]ccc12
: