Target
Tyrosine-protein kinase JAK1
Ligand
BDBM260521
Substrate
Meas. Tech.
In vitro kinase assay
IC50
40.0±n/a nM
Citation
 Zhang, XDong, QLiu, BZhu, YLi, XLan, J Pyrrole heteroaryl ring derivative and method of use thereof US Patent  US10428074 Publication Date 10/1/2019 
Target
Name:
Tyrosine-protein kinase JAK1
Synonyms:
JAK-1 JAK1A JAK1_HUMAN Janus kinase 1 (JAK1) | Janus kinase 1 JAK1
Type:
Protein
Mol. Mass.:
133293.73
Organism:
Homo sapiens (Human)
Description:
P23458
Residue:
1154
  
Inhibitor
Name:
BDBM260521
Synonyms:
US10428074, Example 150 US9527851, example 150
Type:
Small organic molecule
Emp. Form.:
C18H22N8OS
Mol. Mass.:
398.485
SMILES:
CN([C@@H]1C[C@@H]2CCN(C[C@@H]2C1)C(=O)Nc1nncs1)c1ncnc2[nH]ccc12
: