Target
Tyrosine-protein kinase JAK2
Ligand
BDBM260498
Substrate
Meas. Tech.
In vitro kinase assay
IC50
203±n/a nM
Citation
 Zhang, XDong, QLiu, BZhu, YLi, XLan, J Pyrrole heteroaryl ring derivative and method of use thereof US Patent  US10428074 Publication Date 10/1/2019 
Target
Name:
Tyrosine-protein kinase JAK2
Synonyms:
JAK-2 JAK2_HUMAN Janus kinase 2 (JAK2) | Janus kinase 2 (a protein tyrosine kinase)
Type:
Protein
Mol. Mass.:
130684.68
Organism:
Homo sapiens (Human)
Description:
O60674
Residue:
1132
  
Inhibitor
Name:
BDBM260498
Synonyms:
US10428074, Example 92 US9527851, example 92
Type:
Small organic molecule
Emp. Form.:
C17H23N5O3
Mol. Mass.:
345.3962
SMILES:
CN([C@@H]1C[C@H]2CN(C[C@H]2C1)C(=O)[C@H](O)CO)c1ncnc2[nH]ccc12
: