Target
Tyrosine-protein kinase JAK3
Ligand
BDBM260459
Substrate
Meas. Tech.
In vitro kinase assay
IC50
0.300±n/a nM
Citation
 Zhang, XDong, QLiu, BZhu, YLi, XLan, J Pyrrole heteroaryl ring derivative and method of use thereof US Patent  US10428074 Publication Date 10/1/2019 
Target
Name:
Tyrosine-protein kinase JAK3
Synonyms:
JAK-3 JAK3_HUMAN Janus kinase 3 (JAK3) L-JAK | Leukocyte janus kinase
Type:
Protein
Mol. Mass.:
125111.08
Organism:
Homo sapiens (Human)
Description:
P52333
Residue:
1124
  
Inhibitor
Name:
BDBM260459
Synonyms:
US10428074, Example 17 US9527851, example 17
Type:
Small organic molecule
Emp. Form.:
C17H23N5O2
Mol. Mass.:
329.3968
SMILES:
C[C@H](O)C(=O)N1C[C@@H]2C[C@H](C[C@@H]2C1)N(C)c1ncnc2[nH]ccc12
: