Target
Tyrosine-protein kinase JAK3
Ligand
BDBM260521
Substrate
Meas. Tech.
In vitro kinase assay
IC50
148±n/a nM
Citation
 Zhang, XDong, QLiu, BZhu, YLi, XLan, J Pyrrole heteroaryl ring derivative and method of use thereof US Patent  US10428074 Publication Date 10/1/2019 
Target
Name:
Tyrosine-protein kinase JAK3
Synonyms:
JAK-3 JAK3_HUMAN Janus kinase 3 (JAK3) L-JAK | Leukocyte janus kinase
Type:
Protein
Mol. Mass.:
125111.08
Organism:
Homo sapiens (Human)
Description:
P52333
Residue:
1124
  
Inhibitor
Name:
BDBM260521
Synonyms:
US10428074, Example 150 US9527851, example 150
Type:
Small organic molecule
Emp. Form.:
C18H22N8OS
Mol. Mass.:
398.485
SMILES:
CN([C@@H]1C[C@@H]2CCN(C[C@@H]2C1)C(=O)Nc1nncs1)c1ncnc2[nH]ccc12
: