Target
Guanylate cyclase soluble subunit alpha-1/beta-1
Ligand
BDBM415687
Substrate
Meas. Tech.
Binding Assay
Ki
0.074±n/a nM
Citation
 Berger, RChen, YLi, GGarfunkle, JLi, HMiao, SRaghavan, SSmith, CJStelmach, JWhitehead, AZhang, RZhang, YFu, JJi, GJiang, F Soluble guanylate cyclase stimulators US Patent  US10428076 Publication Date 10/1/2019 
Target
Name:
Guanylate cyclase soluble subunit alpha-1/beta-1
Synonyms:
Soluble Guanylate Cyclases Soluble guanylate cyclase alpha 1 and beta 1 subunits (sGC) soluble guanylate cyclase activators | soluble guanylate cyclase apha 1 and soluble guanylate cyclase beta 1
Type:
Enzyme
Mol. Mass.:
Description:
Components:
This complex has 2 components.
Component 1
Name:
Guanylate cyclase soluble subunit alpha-1
Synonyms:
GCS-alpha-1 GCYA1_HUMAN GUCSA3 GUCY1A3 Guanylate cyclase soluble subunit alpha-3 Solube guanylate cyclase alpha-1 (sGCalpha) | soluble guanylate cyclase alpha-1 (sGC)
Type:
Enzyme
Mol. Mass.:
77457.21
Organism:
Homo sapiens (Human)
Description:
Q02108
Residue:
690
  
Component 2
Name:
Guanylate cyclase soluble subunit beta-1
Synonyms:
GCYB1_HUMAN GUCSB3 GUCY1B3 Solube guanylate cyclase beta-1 (sGCβ1) | soluble guanylate cyclase beta-1 (sGC)
Type:
Enzyme
Mol. Mass.:
70496.05
Organism:
Homo sapiens (Human)
Description:
Q02153
Residue:
619
  
Inhibitor
Name:
BDBM415687
Synonyms:
(S)-4-Amino-2-[6-chloro-1-(2-fluorobenzyl)-1H-indazol-3-yl]-5-methyl-5-{4-[2-(5-oxo-4,5-dihydro-1,2,4-oxadiazol-3-yl)ethyl]phenyl}-5,7-dihydro-6H-pyrrolo[2,3-d]pyrimidin-6-one | US10428076, Example 256B
Type:
Small organic molecule
Emp. Form.:
C31H23ClFN7O3
Mol. Mass.:
596.011
SMILES:
C[C@]1(C(=O)Nc2nc(ncc12)-c1nn(Cc2ccccc2F)c2cc(Cl)ccc12)c1ccc(CCc2noc(=O)[nH]2)cc1
: