Target
Adenosine receptor A3
Ligand
BDBM415449
Substrate
Meas. Tech.
Binding Assay
Ki
6800±n/a nM
Citation
 Härter, MKosemund, DDelbeck, MKalthof, BWasnaire, PSüβmeier, FLustig, K Heterocyclylmethyl-thienouracile as antagonists of the adenosine-A2B-receptor US Patent  US10428083 Publication Date 10/1/2019 
Target
Name:
Adenosine receptor A3
Synonyms:
A3 adenosine receptor (hA3) ADORA3 | Adenosine A3 receptor (A3AR)
Type:
G Protein-Coupled Receptor (GPCR)
Mol. Mass.:
36197.32
Organism:
Homo sapiens (Human)
Description:
P0DMS8
Residue:
318
  
Inhibitor
Name:
BDBM415449
Synonyms:
3-Ethyl-5-methyl-1-(oxetan-2-ylmethyl)-6-[(2-oxoimidazolidin-1-yl)methyl]thieno[2,3-d]pyrimidine-2,4(1H,3H)-dione (Enantiomer 1) | US10428083, Example 66
Type:
Small organic molecule
Emp. Form.:
C17H22N4O4S
Mol. Mass.:
378.446
SMILES:
CCn1c(=O)n(CC2CCO2)c2sc(CN3CCNC3=O)c(C)c2c1=O
: