Target
Phosphatidylinositol 4,5-bisphosphate 3-kinase catalytic subunit delta isoform
Ligand
BDBM394285
Substrate
Meas. Tech.
Enzyme Assay
IC50
75±n/a nM
Citation
 Li, YMetcalf, BWCombs, AP Pyrimidinones as PI3K inhibitors US Patent  US10428087 Publication Date 10/1/2019 
Target
Name:
Phosphatidylinositol 4,5-bisphosphate 3-kinase catalytic subunit delta isoform
Synonyms:
PI3-kinase p110 subunit delta PI3-kinase subunit p110-delta PIK3CD Phosphatidylinositol 4,5-biphosphate 3-kinase catalytic subunit delta (PIK3CD) Phosphatidylinositol 4,5-bisphosphate 3-kinase 110 kDa catalytic subunit delta (PI3K delta) Phosphatidylinositol 4,5-bisphosphate 3-kinase catalytic subunit delta (PI3Kdelta) Phosphatidylinositol 4,5-bisphosphate 3-kinase catalytic subunit delta isoform (PI3K delta) Phosphatidylinositol 4,5-bisphosphate 3-kinase catalytic subunit delta isoform (PI3K-delta) Phosphatidylinositol 4,5-bisphosphate 3-kinase catalytic subunit delta isoform (PI3Kdelta)
Type:
Enzyme Subunit
Mol. Mass.:
119489.41
Organism:
Homo sapiens (Human)
Description:
O00329
Residue:
1044
  
Inhibitor
Name:
BDBM394285
Synonyms:
US10428087, Example 4 US11401280, Example 4 | US9975907, Example 4
Type:
Small organic molecule
Emp. Form.:
C23H20FN7O
Mol. Mass.:
429.4496
SMILES:
CCC(Nc1ncnc2[nH]cnc12)c1nc2cccc(C)n2c(=O)c1-c1cccc(F)c1
: