Target
Protein arginine N-methyltransferase 5
Ligand
BDBM415520
Substrate
Meas. Tech.
PRMT5 assay
IC50
9229±n/a nM
Citation
 Tatlock, JHMcAlpine, IJTran-Dube, MBRui, EYWythes, MJKumpf, RAMcTigue, MA Substituted nucleoside derivatives useful as anticancer agents US Patent  US10428104 Publication Date 10/1/2019 
Target
Name:
Protein arginine N-methyltransferase 5
Synonyms:
72 kDa ICln-binding protein HRMT1L5 IBP72 Jak-binding protein 1 PRMT5/MEP50 complex Protein arginine methyltransferase 5 (PRMT5) SKB1 homolog Shk1 kinase-binding protein 1 homolog
Type:
Enzyme
Mol. Mass.:
72679.99
Organism:
Homo sapiens (Human)
Description:
O14744
Residue:
637
  
Inhibitor
Name:
BDBM415520
Synonyms:
US10428104, Example 53
Type:
Small organic molecule
Emp. Form.:
C16H21N3O4
Mol. Mass.:
319.3556
SMILES:
Cc1ncnc2n(ccc12)[C@@H]1O[C@H]([C@@H](O)C2CCC2)[C@@H](O)[C@H]1O
: