Target
Protein arginine N-methyltransferase 5
Ligand
BDBM415536
Substrate
Meas. Tech.
PRMT5 assay
IC50
1560±n/a nM
Citation
 Tatlock, JHMcAlpine, IJTran-Dube, MBRui, EYWythes, MJKumpf, RAMcTigue, MA Substituted nucleoside derivatives useful as anticancer agents US Patent  US10428104 Publication Date 10/1/2019 
Target
Name:
Protein arginine N-methyltransferase 5
Synonyms:
72 kDa ICln-binding protein HRMT1L5 IBP72 Jak-binding protein 1 PRMT5/MEP50 complex Protein arginine methyltransferase 5 (PRMT5) SKB1 homolog Shk1 kinase-binding protein 1 homolog
Type:
Enzyme
Mol. Mass.:
72679.99
Organism:
Homo sapiens (Human)
Description:
O14744
Residue:
637
  
Inhibitor
Name:
BDBM415536
Synonyms:
(Scheme W) (2R,3R,4S,5S)-2-(4-amino-5-fluoro-7H-pyrrolo[2,3-d]pyrimidin-7-yl)-5-phenyltetrahydrofuran-3,4-diol (W-2) | US10428104, Example 67
Type:
Small organic molecule
Emp. Form.:
C16H15FN4O3
Mol. Mass.:
330.3137
SMILES:
Nc1ncnc2n(cc(F)c12)[C@@H]1O[C@H]([C@@H](O)[C@H]1O)c1ccccc1
: