Target
Protein arginine N-methyltransferase 5
Ligand
BDBM415548
Substrate
Meas. Tech.
PRMT5 assay
IC50
5231±n/a nM
Citation
 Tatlock, JHMcAlpine, IJTran-Dube, MBRui, EYWythes, MJKumpf, RAMcTigue, MA Substituted nucleoside derivatives useful as anticancer agents US Patent  US10428104 Publication Date 10/1/2019 
Target
Name:
Protein arginine N-methyltransferase 5
Synonyms:
72 kDa ICln-binding protein HRMT1L5 IBP72 Jak-binding protein 1 PRMT5/MEP50 complex Protein arginine methyltransferase 5 (PRMT5) SKB1 homolog Shk1 kinase-binding protein 1 homolog
Type:
Enzyme
Mol. Mass.:
72679.99
Organism:
Homo sapiens (Human)
Description:
O14744
Residue:
637
  
Inhibitor
Name:
BDBM415548
Synonyms:
(Scheme HH) (2S,3S,4R,5R)-2-(1,2-dihydroxyethyl)-5-(4-methyl-7H-pyrrolo[2,3-d]pyrimidin-7-yl)tetrahydrofuran-3,4-diol (GG-1) | US10428104, Example 79
Type:
Small organic molecule
Emp. Form.:
C13H17N3O5
Mol. Mass.:
295.2912
SMILES:
Cc1ncnc2n(ccc12)[C@@H]1O[C@@H](C(O)CO)[C@@H](O)[C@H]1O
: