Target
Protein arginine N-methyltransferase 5
Ligand
BDBM415553
Substrate
Meas. Tech.
PRMT5 assay
IC50
3.00±n/a nM
Citation
 Tatlock, JHMcAlpine, IJTran-Dube, MBRui, EYWythes, MJKumpf, RAMcTigue, MA Substituted nucleoside derivatives useful as anticancer agents US Patent  US10428104 Publication Date 10/1/2019 
Target
Name:
Protein arginine N-methyltransferase 5
Synonyms:
72 kDa ICln-binding protein HRMT1L5 IBP72 Jak-binding protein 1 PRMT5/MEP50 complex Protein arginine methyltransferase 5 (PRMT5) SKB1 homolog Shk1 kinase-binding protein 1 homolog
Type:
Enzyme
Mol. Mass.:
72679.99
Organism:
Homo sapiens (Human)
Description:
O14744
Residue:
637
  
Inhibitor
Name:
BDBM415553
Synonyms:
(2R,3R,4S,5R)-2-(6-amino-9H-purin-9-yl)-5-((R)-(3,4-difluorophenyl)(hydroxy)methyl)tetrahydrofuran-3,4-diol (LL-6) | US10428104, Example 84
Type:
Small organic molecule
Emp. Form.:
C19H17ClF2N4O4
Mol. Mass.:
438.812
SMILES:
CC1(C)O[C@@H]2[C@H](O[C@H]([C@@H]2O1)n1cnc2c(Cl)ncnc12)[C@H](O)c1ccc(F)c(F)c1
: