Target
Protein arginine N-methyltransferase 5
Ligand
BDBM415575
Substrate
Meas. Tech.
PRMT5 assay
IC50
2.00±n/a nM
Citation
 Tatlock, JHMcAlpine, IJTran-Dube, MBRui, EYWythes, MJKumpf, RAMcTigue, MA Substituted nucleoside derivatives useful as anticancer agents US Patent  US10428104 Publication Date 10/1/2019 
Target
Name:
Protein arginine N-methyltransferase 5
Synonyms:
72 kDa ICln-binding protein HRMT1L5 IBP72 Jak-binding protein 1 PRMT5/MEP50 complex Protein arginine methyltransferase 5 (PRMT5) SKB1 homolog Shk1 kinase-binding protein 1 homolog
Type:
Enzyme
Mol. Mass.:
72679.99
Organism:
Homo sapiens (Human)
Description:
O14744
Residue:
637
  
Inhibitor
Name:
BDBM415575
Synonyms:
(2R,3R,4S,5S)-2-(4-amino-7H-pyrrolo[2,3-d]pyrimidin-7-yl)-5-((R)-1-(4-chloro-3-fluorophenyl)-1-hydroxyethyl)tetrahydrofuran-3,4-diol (DDD-5) | US10428104, Example 105
Type:
Small organic molecule
Emp. Form.:
C21H20Cl2FN3O4
Mol. Mass.:
468.306
SMILES:
C[C@](O)([C@H]1O[C@H](C2OC(C)(C)O[C@H]12)n1ccc2c(Cl)ncnc12)c1ccc(Cl)c(F)c1
: