Target
Rho-associated protein kinase 2
Ligand
BDBM295330
Substrate
Meas. Tech.
In Vitro Assays
pH
7.5±n/a
IC50
5±n/a nM
Comments
extracted
Citation
 Glunz, PWSitkoff, DFBodas, MSYadav, NDPatil, SMaddu Rao, PS Lactams as inhibitors of rock US Patent  US10112929 Publication Date 10/30/2018 
Target
Name:
Rho-associated protein kinase 2
Synonyms:
KIAA0619 ROCK2 Rho kinase 2 (ROCKII) Rho-associated protein kinase 2 (ROCK2) Rho-associated protein kinase 2/Transforming protein RhoA Rho-associated, coiled-coil-containing protein kinase II p164 ROCK-2
Type:
Protein
Mol. Mass.:
160885.43
Organism:
Homo sapiens (Human)
Description:
O75116
Residue:
1388
  
Inhibitor
Name:
BDBM295330
Synonyms:
US10112929, Example 47 | US10112929, Example 48
Type:
Small organic molecule
Emp. Form.:
C19H16F2N4O
Mol. Mass.:
354.3533
SMILES:
Fc1cccc(NC2CCN(C2=O)c2ccc(-c3cn[nH]c3)c(F)c2)c1
: