Target
Serine protease HTRA1
Ligand
BDBM415605
Substrate
Meas. Tech.
Enzyme Inhibition Assay
IC50
410±n/a nM
Citation
 Hornsperger, BIacone, RKitas, EAMaerki, HPReutlinger, MMohr, P Difluoroketamide derivatives US Patent  US10428108 Publication Date 10/1/2019 
Target
Name:
Serine protease HTRA1
Synonyms:
HTRA HTRA1_HUMAN | PRSS11
Type:
Protein
Mol. Mass.:
51293.95
Organism:
Homo sapiens (Human)
Description:
Q92743
Residue:
480
  
Inhibitor
Name:
BDBM415605
Synonyms:
US10428108, Example 16
Type:
Small organic molecule
Emp. Form.:
C33H35Cl2F2N3O4
Mol. Mass.:
646.552
SMILES:
CC(C)[C@H](NC(=O)[C@H](Cc1ccccc1)NC(=O)CCc1ccc(Cl)c(Cl)c1)C(=O)C(F)(F)C(=O)NCCc1ccccc1
: