Target
Serine protease HTRA1
Ligand
BDBM415632
Substrate
Meas. Tech.
Enzyme Inhibition Assay
IC50
50.0±n/a nM
Citation
 Hornsperger, BIacone, RKitas, EAMaerki, HPReutlinger, MMohr, P Difluoroketamide derivatives US Patent  US10428108 Publication Date 10/1/2019 
Target
Name:
Serine protease HTRA1
Synonyms:
HTRA HTRA1_HUMAN | PRSS11
Type:
Protein
Mol. Mass.:
51293.95
Organism:
Homo sapiens (Human)
Description:
Q92743
Residue:
480
  
Inhibitor
Name:
BDBM415632
Synonyms:
US10428108, Example 43
Type:
Small organic molecule
Emp. Form.:
C26H24Cl2F7N3O5
Mol. Mass.:
662.381
SMILES:
CC(C)[C@H](NC(=O)[C@H](Cc1ccc(F)c(F)c1)NC(=O)COc1cc(Cl)cc(Cl)c1)C(=O)C(F)(F)C(=O)NCC(F)(F)F
: