Target
Serine protease HTRA1
Ligand
BDBM415642
Substrate
Meas. Tech.
Enzyme Inhibition Assay
IC50
20.0±n/a nM
Citation
 Hornsperger, BIacone, RKitas, EAMaerki, HPReutlinger, MMohr, P Difluoroketamide derivatives US Patent  US10428108 Publication Date 10/1/2019 
Target
Name:
Serine protease HTRA1
Synonyms:
HTRA HTRA1_HUMAN | PRSS11
Type:
Protein
Mol. Mass.:
51293.95
Organism:
Homo sapiens (Human)
Description:
Q92743
Residue:
480
  
Inhibitor
Name:
BDBM415642
Synonyms:
US10428108, Example 53
Type:
Small organic molecule
Emp. Form.:
C33H31Cl3F5N3O4
Mol. Mass.:
734.968
SMILES:
CC(C)[C@H](NC(=O)[C@H](Cc1ccc(Cl)cc1)NC(=O)CC(c1ccccc1)c1ccc(Cl)c(Cl)c1)C(=O)C(F)(F)C(=O)NCC(F)(F)F
: