Target
Serine protease HTRA1
Ligand
BDBM415670
Substrate
Meas. Tech.
Enzyme Inhibition Assay
IC50
9.00±n/a nM
Citation
 Hornsperger, BIacone, RKitas, EAMaerki, HPReutlinger, MMohr, P Difluoroketamide derivatives US Patent  US10428108 Publication Date 10/1/2019 
Target
Name:
Serine protease HTRA1
Synonyms:
HTRA HTRA1_HUMAN | PRSS11
Type:
Protein
Mol. Mass.:
51293.95
Organism:
Homo sapiens (Human)
Description:
Q92743
Residue:
480
  
Inhibitor
Name:
BDBM415670
Synonyms:
US10428108, Example 80
Type:
Small organic molecule
Emp. Form.:
C32H30Cl2F5N3O5
Mol. Mass.:
702.496
SMILES:
CC(C)[C@H](NC(=O)[C@@H](NC(=O)C[C@H](Oc1cccc(Cl)c1)c1ccccc1)c1ccc(Cl)cc1)C(=O)C(F)(F)C(=O)NCC(F)(F)F
: