Target
Kelch-like ECH-associated protein 1/Nuclear factor erythroid 2-related factor 2
Ligand
BDBM415602
Substrate
Meas. Tech.
Fluorescence Polarization-Based Protein-Protein Interaction Inhibition
IC50
1320±n/a nM
Citation
 You, QJiang, ZLu, MChen, ZSun, HZhang, XGuo, XXu, X 1-sulfonamido-4-aryloxy compounds, and preparation method and medicinal application thereof US Patent  US10442759 Publication Date 10/15/2019 
Target
Name:
Kelch-like ECH-associated protein 1/Nuclear factor erythroid 2-related factor 2
Synonyms:
Nrf2-Keap1 protein
Type:
Protein
Mol. Mass.:
Description:
Components:
This complex has 2 components.
Component 1
Name:
Nuclear factor erythroid 2-related factor 2
Synonyms:
HEBP1 NF-E2-related factor 2 NFE2-related factor 2 NRF2 Nuclear factor, erythroid derived 2, like 2
Type:
PROTEIN
Mol. Mass.:
67786.89
Organism:
Homo sapiens (Human)
Description:
ChEMBL_107924
Residue:
605
  
Component 2
Name:
Kelch-like ECH-associated protein 1
Synonyms:
Cytosolic inhibitor of Nrf2 KEAP1 KEAP1_HUMAN KLHL19 | Kelch-like protein 19
Type:
PROTEIN
Mol. Mass.:
69664.53
Organism:
Homo sapiens (Human)
Description:
ChEMBL_107924
Residue:
624
  
Inhibitor
Name:
BDBM415602
Synonyms:
US10442759, Compound I-2
Type:
Small organic molecule
Emp. Form.:
C29H28N2O6S
Mol. Mass.:
532.607
SMILES:
Cc1cc(C)c(c(C)c1)S(=O)(=O)N(CC(N)=O)c1ccc(OC(C(O)=O)c2ccccc2)c2ccccc12
: