Target
Bromodomain-containing protein 4 [342-460]
Ligand
BDBM343435
Substrate
Meas. Tech.
AlphaScreen Assay
IC50
<1000±n/a nM
Citation
 Rodgers, JDShepard, SWang, HShao, L Tricyclic heterocycles as bet protein inhibitors US Patent  US10442803 Publication Date 10/15/2019 
Target
Name:
Bromodomain-containing protein 4 [342-460]
Synonyms:
BRD4 BRD4_HUMAN Bromodomain-containing protein 4 (BRD4)(BD2) | HUNK1
Type:
Enzyme Catalytic Domain
Mol. Mass.:
13783.81
Organism:
Homo sapiens (Human)
Description:
a.a. 342-460 (BRD4-BD2)
Residue:
119
  
Inhibitor
Name:
BDBM343435
Synonyms:
US10442803, Example 34 US9777003, Example 34
Type:
Small organic molecule
Emp. Form.:
C18H18N4O
Mol. Mass.:
306.3617
SMILES:
COc1ccc(Cn2c(C)cc3c2ccc2nnc(C)n32)cc1
: