Target
Bromodomain-containing protein 4 [42-168]
Ligand
BDBM343458
Substrate
Meas. Tech.
AlphaScreen Assay
IC50
300±n/a nM
Citation
 Rodgers, JDShepard, SWang, HShao, L Tricyclic heterocycles as bet protein inhibitors US Patent  US10442803 Publication Date 10/15/2019 
Target
Name:
Bromodomain-containing protein 4 [42-168]
Synonyms:
BRD4 BRD4_HUMAN HUNK1
Type:
Enzyme Catalytic Domain
Mol. Mass.:
15054.68
Organism:
Homo sapiens (Human)
Description:
O60885[42-168]
Residue:
127
  
Inhibitor
Name:
BDBM343458
Synonyms:
US10442803, Example 57 US9777003, Example 57
Type:
Small organic molecule
Emp. Form.:
C20H18N6
Mol. Mass.:
342.3971
SMILES:
Cc1nnc2ccc3n(Cc4ccccc4)c(Cn4ccnc4)cc3n12
: