Target
Bromodomain-containing protein 4 [42-168]
Ligand
BDBM343523
Substrate
Meas. Tech.
AlphaScreen Assay
IC50
<1000±n/a nM
Citation
 Rodgers, JDShepard, SWang, HShao, L Tricyclic heterocycles as bet protein inhibitors US Patent  US10442803 Publication Date 10/15/2019 
Target
Name:
Bromodomain-containing protein 4 [42-168]
Synonyms:
BRD4 BRD4_HUMAN HUNK1
Type:
Enzyme Catalytic Domain
Mol. Mass.:
15054.68
Organism:
Homo sapiens (Human)
Description:
O60885[42-168]
Residue:
127
  
Inhibitor
Name:
BDBM343523
Synonyms:
US10442803, Example 122 US9777003, Example 122
Type:
Small organic molecule
Emp. Form.:
C22H24N6O
Mol. Mass.:
388.4656
SMILES:
CNC(=O)c1cc2c(ccc3nnc(C)n23)n1Cc1cccc(CN2CCC2)c1
: