Target
Mucosa-associated lymphoid tissue lymphoma translocation protein 1 [329-824]
Ligand
BDBM355891
Substrate
Meas. Tech.
Biochemical Assay
IC50
0.005±n/a nM
Citation
 Soldermann, CPQuancard, JSchlapbach, ASimic, OTintelnot-Blomley, MZoller, T Pyrazolo pyrimidine derivatives and their use as MALT1 inhbitors US Patent  US10442808 Publication Date 10/15/2019 
Target
Name:
Mucosa-associated lymphoid tissue lymphoma translocation protein 1 [329-824]
Synonyms:
MALT1 MLT | Mucosa-associated lymphoid tissue lymphoma translocation protein 1 (MALT1)(aa 329-824)
Type:
Enzyme Catalytic Domain
Mol. Mass.:
55563.19
Organism:
Homo sapiens (Human)
Description:
amino acids 329-824
Residue:
495
  
Inhibitor
Name:
BDBM355891
Synonyms:
1-(2-chloro-7-(2- methoxypropan-2- yl)pyrazolo[1,5- a]pyrimidin-6-yl)-3- (2- (trifluoromethyl)pyridin- 4-yl)urea US9815842, Example 15
Type:
Small organic molecule
Emp. Form.:
C17H16ClF3N6O2
Mol. Mass.:
428.796
SMILES:
COC(C)(C)c1c(NC(=O)Nc2ccnc(c2)C(F)(F)F)cnc2cc(Cl)nn12
: