Target
Mucosa-associated lymphoid tissue lymphoma translocation protein 1 [329-824]
Ligand
BDBM355919
Substrate
Meas. Tech.
Biochemical Assay
IC50
0.009±n/a nM
Citation
 Soldermann, CPQuancard, JSchlapbach, ASimic, OTintelnot-Blomley, MZoller, T Pyrazolo pyrimidine derivatives and their use as MALT1 inhbitors US Patent  US10442808 Publication Date 10/15/2019 
Target
Name:
Mucosa-associated lymphoid tissue lymphoma translocation protein 1 [329-824]
Synonyms:
MALT1 MLT | Mucosa-associated lymphoid tissue lymphoma translocation protein 1 (MALT1)(aa 329-824)
Type:
Enzyme Catalytic Domain
Mol. Mass.:
55563.19
Organism:
Homo sapiens (Human)
Description:
amino acids 329-824
Residue:
495
  
Inhibitor
Name:
BDBM355919
Synonyms:
1-(5-chloro-6-(2H- 1,2,3-triazol-2- yl)pyridin-3-yl)-3-(2- chloro-7-(1,4-dioxan- 2-yl)pyrazolo[1,5- a]pyrimidin-6-yl)urea US9815842, Example 43
Type:
Small organic molecule
Emp. Form.:
C18H15Cl2N9O3
Mol. Mass.:
476.276
SMILES:
Clc1cc2ncc(NC(=O)Nc3cnc(c(Cl)c3)-n3nccn3)c(C3COCCO3)n2n1
: