Target
Tyrosine-protein kinase Mer
Ligand
BDBM396990
Substrate
Meas. Tech.
TAM Enzymatic Assay
IC50
<5±n/a nM
Citation
 Li, YWang, XHe, C Pyrrolotriazine compounds as TAM inhibitors US Patent  US10442810 Publication Date 10/15/2019 
Target
Name:
Tyrosine-protein kinase Mer
Synonyms:
MER MERTK Proto-oncogene c-Mer Receptor tyrosine kinase MerTK | Tyrosine-protein kinase Mer
Type:
PROTEIN
Mol. Mass.:
110234.77
Organism:
Homo sapiens (Human)
Description:
ChEMBL_1498723
Residue:
999
  
Inhibitor
Name:
BDBM396990
Synonyms:
US10442810, Example 52 US11591338, Example 52 | US9981975, Example 52
Type:
Small organic molecule
Emp. Form.:
C31H31N7O3
Mol. Mass.:
549.6229
SMILES:
Nc1ncnn2c(cc(-c3ccc(NC(=O)c4cccn(-c5ccccc5)c4=O)cc3)c12)C1CCN(CCO)CC1
: