Target
Isocitrate dehydrogenase [NADP] cytoplasmic [R132H]
Ligand
BDBM416009
Substrate
Meas. Tech.
Enzymatic Assay
IC50
13.0±n/a nM
Citation
Target
Name:
Isocitrate dehydrogenase [NADP] cytoplasmic [R132H]
Synonyms:
Cytosolic NADP-isocitrate dehydrogenase (IDH1)(R132H) IDH1 R132H IDHC_HUMAN Isocitrate dehydrogenase 1 mutant (R132H) Isocitrate dehydrogenase [NADP] cytoplasmic (IDH1)(R132H) PICD
Type:
Protein
Mol. Mass.:
46641.74
Organism:
Homo sapiens (Human)
Description:
Human IDH1 R132H (SEQ ID No. 2 in patent). First three are removed. Google patent parsed wrong.
Residue:
414
  
Inhibitor
Name:
BDBM416009
Synonyms:
6-{[(1R,3S,4S)-3- ethoxy-4- fluorocyclopentyl]carbon- yl}-8-[(1S,4S)-2-oxa- 5-azabicyclo[2.2.2]oct- 5-yl]-6,11-dihydro-5H- pyrido[2,3- b][1,5]benzodiazepine | US10442819, Example 157
Type:
Small organic molecule
Emp. Form.:
C26H31FN4O3
Mol. Mass.:
466.5477
SMILES:
CCO[C@H]1C[C@H](C[C@@H]1F)C(=O)N1Cc2cccnc2Nc2ccc(cc12)N1C[C@@H]2CC[C@H]1CO2
: