Target
Isocitrate dehydrogenase [NADP] cytoplasmic [R132H]
Ligand
BDBM416012
Substrate
Meas. Tech.
Enzymatic Assay
IC50
15.0±n/a nM
Citation
Target
Name:
Isocitrate dehydrogenase [NADP] cytoplasmic [R132H]
Synonyms:
Cytosolic NADP-isocitrate dehydrogenase (IDH1)(R132H) IDH1 R132H IDHC_HUMAN Isocitrate dehydrogenase 1 mutant (R132H) Isocitrate dehydrogenase [NADP] cytoplasmic (IDH1)(R132H) PICD
Type:
Protein
Mol. Mass.:
46641.74
Organism:
Homo sapiens (Human)
Description:
Human IDH1 R132H (SEQ ID No. 2 in patent). First three are removed. Google patent parsed wrong.
Residue:
414
  
Inhibitor
Name:
BDBM416012
Synonyms:
(8-(8-oxa-3- azabicyclo[3.2.1]octan- 3-yl)-5,11-dihydro-6H- benzo[b]pyrido[2,3- e][1,4]diazepin-6- yl)((2R,5S)-5- isopropoxytetrahydro- 2H-pyran-2- yl)methanone | US10442819, Example 160
Type:
Small organic molecule
Emp. Form.:
C27H34N4O4
Mol. Mass.:
478.5833
SMILES:
CC(C)O[C@H]1CC[C@@H](OC1)C(=O)N1Cc2cccnc2Nc2ccc(cc12)N1CC2CCC(C1)O2
: