Target
Nuclear receptor ROR-gamma
Ligand
BDBM416526
Substrate
Meas. Tech.
Radio-Ligand RORgamma Binding Assay (Assay 1)
Ki
<100±n/a nM
Citation
 Claremon, DADillard, LWFan, YLotesta, SDSingh, SBTice, CMZhao, WZhuang, L Substituted indoles as modulators of ROR-gamma US Patent  US10301261 Publication Date 5/28/2019 
Target
Name:
Nuclear receptor ROR-gamma
Synonyms:
NR1F3 Nuclear receptor ROR-gamma (RORC) RAR-related orphan receptor C (RORc) RORG RZRG Retinoid-related orphan receptor-gamma (RORc)
Type:
Enzyme Catalytic Domain
Mol. Mass.:
58218.40
Organism:
Homo sapiens (Human)
Description:
P51449
Residue:
518
  
Inhibitor
Name:
BDBM416526
Synonyms:
2-(4-(ethylsulfonyl)phenyl)-N-(1-isobutyl-2-(4-(trifluoromethyl)benzyl)-1H-benzo[d]imidazol-5-yl)acetamide US10829448, Compound BE-68
Type:
Small organic molecule
Emp. Form.:
C29H30F3N3O3S
Mol. Mass.:
557.627
SMILES:
CCS(=O)(=O)c1ccc(CC(=O)Nc2ccc3n(CC(C)C)c(Cc4ccc(cc4)C(F)(F)F)nc3c2)cc1
: