Target
CAM kinase, CDPK family TgCDPK1
Ligand
BDBM416560
Substrate
Meas. Tech.
TgCDPK1 Enzymatic Inhibition Assay
IC50
0.900±n/a nM
Citation
 Hol, WGLarson, ETMaly, DJVan Voorhis, WCMerritt, EOjo, KK Compositions and methods for treating toxoplasmosis, cryptosporidiosis and other apicomplexan protozoan related diseases US Patent  US10307425 Publication Date 6/4/2019 
Target
Name:
CAM kinase, CDPK family TgCDPK1
Synonyms:
TgCDPK1
Type:
Enzyme Catalytic Domain
Mol. Mass.:
57248.42
Organism:
Toxoplasma gondii (strain ATCC 50861 / VEG)
Description:
Residue:
507
  
Inhibitor
Name:
BDBM416560
Synonyms:
US10307425, Example 26 | US10632122, Example 26
Type:
Small organic molecule
Emp. Form.:
C23H25N5O2
Mol. Mass.:
403.4769
SMILES:
CC(C)(CO)Cn1nc(-c2ccc3cc(OC4CC4)ccc3c2)c2c(N)ncnc12
: