Target
CAM kinase, CDPK family TgCDPK1
Ligand
BDBM416580
Substrate
Meas. Tech.
TgCDPK1 Enzymatic Inhibition Assay
IC50
10.8±n/a nM
Citation
 Hol, WGLarson, ETMaly, DJVan Voorhis, WCMerritt, EOjo, KK Compositions and methods for treating toxoplasmosis, cryptosporidiosis and other apicomplexan protozoan related diseases US Patent  US10307425 Publication Date 6/4/2019 
Target
Name:
CAM kinase, CDPK family TgCDPK1
Synonyms:
TgCDPK1
Type:
Enzyme Catalytic Domain
Mol. Mass.:
57248.42
Organism:
Toxoplasma gondii (strain ATCC 50861 / VEG)
Description:
Residue:
507
  
Inhibitor
Name:
BDBM416580
Synonyms:
3-(7-ethoxynaphthalen-2-yl)-1-isobutyl-1H-pyrazolo[3,4-d]pyrimidin-4-amine US10632122, Example 47
Type:
Small organic molecule
Emp. Form.:
C21H23N5O
Mol. Mass.:
361.4402
SMILES:
CCOc1ccc2ccc(cc2c1)-c1nn(CC(C)C)c2ncnc(N)c12
: