Target
CAM kinase, CDPK family TgCDPK1
Ligand
BDBM416585
Substrate
Meas. Tech.
TgCDPK1 Enzymatic Inhibition Assay
IC50
84.2±n/a nM
Citation
 Hol, WGLarson, ETMaly, DJVan Voorhis, WCMerritt, EOjo, KK Compositions and methods for treating toxoplasmosis, cryptosporidiosis and other apicomplexan protozoan related diseases US Patent  US10307425 Publication Date 6/4/2019 
Target
Name:
CAM kinase, CDPK family TgCDPK1
Synonyms:
TgCDPK1
Type:
Enzyme Catalytic Domain
Mol. Mass.:
57248.42
Organism:
Toxoplasma gondii (strain ATCC 50861 / VEG)
Description:
Residue:
507
  
Inhibitor
Name:
BDBM416585
Synonyms:
2-((4-amino-3-(6-(methoxymethyl)naphthalen-2-yl)-1H-pyrazolo[3,4-d]pyrimidin-1-yl)methyl)-1,1,1,3,3,3-hexafluoropropan-2-ol US10632122, Example 52
Type:
Small organic molecule
Emp. Form.:
C21H17F6N5O2
Mol. Mass.:
485.3824
SMILES:
COCc1ccc2cc(ccc2c1)-c1nn(CC(O)(C(F)(F)F)C(F)(F)F)c2ncnc(N)c12
: