Target
CAM kinase, CDPK family TgCDPK1
Ligand
BDBM50389750
Substrate
Meas. Tech.
TgCDPK1 Enzymatic Inhibition Assay
IC50
4.30±n/a nM
Citation
 Hol, WGLarson, ETMaly, DJVan Voorhis, WCMerritt, EOjo, KK Compositions and methods for treating toxoplasmosis, cryptosporidiosis and other apicomplexan protozoan related diseases US Patent  US10307425 Publication Date 6/4/2019 
Target
Name:
CAM kinase, CDPK family TgCDPK1
Synonyms:
TgCDPK1
Type:
Enzyme Catalytic Domain
Mol. Mass.:
57248.42
Organism:
Toxoplasma gondii (strain ATCC 50861 / VEG)
Description:
Residue:
507
  
Inhibitor
Name:
BDBM50389750
Synonyms:
CHEMBL2070089 US10632122, Example 111
Type:
Small organic molecule
Emp. Form.:
C27H35N7O
Mol. Mass.:
473.6131
SMILES:
CCOc1ccc2cc(ccc2c1)-c1nn(CCC2CCN(CCCN)CC2)c2ncnc(N)c12
: