Target
CAM kinase, CDPK family TgCDPK1
Ligand
BDBM50389684
Substrate
Meas. Tech.
TgCDPK1 Enzymatic Inhibition Assay
IC50
3.40±n/a nM
Citation
 Hol, WGLarson, ETMaly, DJVan Voorhis, WCMerritt, EOjo, KK Compositions and methods for treating toxoplasmosis, cryptosporidiosis and other apicomplexan protozoan related diseases US Patent  US10307425 Publication Date 6/4/2019 
Target
Name:
CAM kinase, CDPK family TgCDPK1
Synonyms:
TgCDPK1
Type:
Enzyme Catalytic Domain
Mol. Mass.:
57248.42
Organism:
Toxoplasma gondii (strain ATCC 50861 / VEG)
Description:
Residue:
507
  
Inhibitor
Name:
BDBM50389684
Synonyms:
CHEMBL2070051 US10632122, Example 119
Type:
Small organic molecule
Emp. Form.:
C22H25N7O
Mol. Mass.:
403.4802
SMILES:
CCOc1ccc2cc(ccc2n1)-c1nn(CC2CCNCC2)c2ncnc(N)c12
: