Target
Serine/threonine-protein kinase/endoribonuclease IRE1
Ligand
BDBM416660
Substrate
Meas. Tech.
FRET-suppression assay
IC50
>20000±n/a nM
Citation
 Del Valle, JRHu, CA Inhibitors of the IRE-1/XBP-1 pathway and methods of using thereof US Patent  US10323013 Publication Date 6/18/2019 
Target
Name:
Serine/threonine-protein kinase/endoribonuclease IRE1
Synonyms:
ERN1 Endoplasmic reticulum-to-nucleus signaling 1 IRE1 Inositol requiring enzyme 1 (IRE-1alpha) Inositol-requiring protein 1 Ire1-alpha Serine/threonine-protein kinase/endoribonuclease IRE1 hIRE1p
Type:
Enzyme
Mol. Mass.:
109731.20
Organism:
Homo sapiens (Human)
Description:
O75460
Residue:
977
  
Inhibitor
Name:
BDBM416660
Synonyms:
US10323013, Compound 38 | allyl 8-hydroxy-7-(2-(methylsulfonyl)vinyl)-5-oxo-4,5-dihydro-1H-chromeno[3,4-c]pyridine-3(2H)-carboxylate
Type:
Small organic molecule
Emp. Form.:
C19H19NO7S
Mol. Mass.:
405.422
SMILES:
CS(=O)(=O)C=Cc1c(O)ccc2c3CCN(Cc3c(=O)oc12)C(=O)OCC=C
: