Target
Glutaminase kidney isoform, mitochondrial
Ligand
BDBM416650
Substrate
Meas. Tech.
GLS Enzyme Potency Assay
IC50
42.3±n/a nM
Citation
 Nissink, JWFinlay, MRCharles, MD 1,3,4-thiadiazole compounds and their use in treating cancer US Patent  US10323028 Publication Date 6/18/2019 
Target
Name:
Glutaminase kidney isoform, mitochondrial
Synonyms:
GLS GLSK_HUMAN K-glutaminase L-glutamine amidohydrolase
Type:
Protein
Mol. Mass.:
73471.89
Organism:
Homo sapiens (Human)
Description:
O94925
Residue:
669
  
Inhibitor
Name:
BDBM416650
Synonyms:
(2S)-2-(3,5-Dimethoxyphenyl)-2-methoxy-N-[5-[[(3R)-1-(6-methylpyridazin-3-yl)pyrrolidin-3-yl]amino]-1,3,4-thiadiazol-2-yl]acetamide and (2R)-2-(3,5-Dimethoxyphenyl)-2-methoxy-N-[5-[[(3R)-1-(6-methylpyridazin-3-yl)pyrrolidin-3-yl]amino]-1,3,4-thiadiazol-2-yl]acetamide US10981904, Example 4(a)
Type:
Small organic molecule
Emp. Form.:
C22H27N7O4S
Mol. Mass.:
485.559
SMILES:
CO[C@H](C(=O)Nc1nnc(N[C@@H]2CCN(C2)c2ccc(C)nn2)s1)c1cc(OC)cc(OC)c1
: