Target
Glutaminase kidney isoform, mitochondrial
Ligand
BDBM416687
Substrate
Meas. Tech.
GLS Enzyme Potency Assay
IC50
48.2±n/a nM
Citation
 Nissink, JWFinlay, MRCharles, MD 1,3,4-thiadiazole compounds and their use in treating cancer US Patent  US10323028 Publication Date 6/18/2019 
Target
Name:
Glutaminase kidney isoform, mitochondrial
Synonyms:
GLS GLSK_HUMAN K-glutaminase L-glutamine amidohydrolase
Type:
Protein
Mol. Mass.:
73471.89
Organism:
Homo sapiens (Human)
Description:
O94925
Residue:
669
  
Inhibitor
Name:
BDBM416687
Synonyms:
(2R)-2-(3,5-Dimethoxyphenyl)-2-methoxy-N-[5-[[(3R)-1-pyridazin-3-ylpyrrolidin-3-yl]amino]-1,3,4-thiadiazol-2-yl]acetamide and (2R)-2-(3,5-Dimethoxyphenyl)-2-methoxy-N-[5-[[(3R)-1-pyridazin-3-ylpyrrolidin-3-yl]amino]-1,3,4-thiadiazol-2-yl]acetamide US10981904, Example 43
Type:
Small organic molecule
Emp. Form.:
C21H25N7O4S
Mol. Mass.:
471.533
SMILES:
CO[C@@H](C(=O)Nc1nnc(N[C@@H]2CCN(C2)c2cccnn2)s1)c1cc(OC)cc(OC)c1
: