Target
Glutaminase kidney isoform, mitochondrial
Ligand
BDBM416688
Substrate
Meas. Tech.
GLS Enzyme Potency Assay
IC50
68.5±n/a nM
Citation
 Nissink, JWFinlay, MRCharles, MD 1,3,4-thiadiazole compounds and their use in treating cancer US Patent  US10323028 Publication Date 6/18/2019 
Target
Name:
Glutaminase kidney isoform, mitochondrial
Synonyms:
GLS GLSK_HUMAN K-glutaminase L-glutamine amidohydrolase
Type:
Protein
Mol. Mass.:
73471.89
Organism:
Homo sapiens (Human)
Description:
O94925
Residue:
669
  
Inhibitor
Name:
BDBM416688
Synonyms:
(2S)-2-ethoxy-2-[3-(3-methoxyazetidin-1-yl)phenyl]-N-[5-[[(3R)-1-pyridazin-3-ylpyrrolidin-3-yl]amino]-1,3,4-thiadiazol-2-yl]acetamide and (2R)-2-ethoxy-2-[3-(3-methoxyazetidin-1-yl)phenyl]-N-[5-[[(3R)-1-pyridazin-3-ylpyrrolidin-3-yl]amino]-1,3,4-thiadiazol-2-yl]acetamide US10981904, Example 33
Type:
Small organic molecule
Emp. Form.:
C24H30N8O3S
Mol. Mass.:
510.612
SMILES:
CCO[C@H](C(=O)Nc1nnc(N[C@@H]2CCN(C2)c2cccnn2)s1)c1cccc(c1)N1CC(C1)OC
: