Target
Glutaminase kidney isoform, mitochondrial
Ligand
BDBM416691
Substrate
Meas. Tech.
GLS Enzyme Potency Assay
IC50
52.6±n/a nM
Citation
 Nissink, JWFinlay, MRCharles, MD 1,3,4-thiadiazole compounds and their use in treating cancer US Patent  US10323028 Publication Date 6/18/2019 
Target
Name:
Glutaminase kidney isoform, mitochondrial
Synonyms:
GLS GLSK_HUMAN K-glutaminase L-glutamine amidohydrolase
Type:
Protein
Mol. Mass.:
73471.89
Organism:
Homo sapiens (Human)
Description:
O94925
Residue:
669
  
Inhibitor
Name:
BDBM416691
Synonyms:
2-methoxy-2-[3-(oxetan-3-yl)phenyl]-N-[5-[[(3R)-1-(1,2,4-triazin-3-yl)pyrrolidin-3-yl]amino]-1,3,4-thiadiazol-2-yl]acetamide US10323028, Example 25
Type:
Small organic molecule
Emp. Form.:
C21H24N8O3S
Mol. Mass.:
468.532
SMILES:
COC(C(=O)Nc1nnc(N[C@@H]2CCN(C2)c2nccnn2)s1)c1cccc(c1)C1COC1
: