Target
Tyrosine-protein kinase BTK
Ligand
BDBM390014
Substrate
Meas. Tech.
Btk Kinase Assay
IC50
<10±n/a nM
Citation
 Liu, DZhang, MHu, Q Aminopyridazinone compounds as protein kinase inhibitors US Patent  US10323037 Publication Date 6/18/2019 
Target
Name:
Tyrosine-protein kinase BTK
Synonyms:
AGMX1 Agammaglobulinaemia tyrosine kinase B cell progenitor kinase BPK BTK_HUMAN Tyrosine Kinase BTK Tyrosine-protein kinase BTK (BTK)
Type:
Enzyme
Mol. Mass.:
76289.95
Organism:
Homo sapiens (Human)
Description:
Q06187
Residue:
659
  
Inhibitor
Name:
BDBM390014
Synonyms:
4-amino-1-[(3R)-1-[(E)-4- (cyclopropylamino)but-2-enoyl]-3- piperidyl]-3-(4-phenoxyphenyl)-6H- pyrrolo[2,3-d]pyridazin-7-one US9951077, 28
Type:
Small organic molecule
Emp. Form.:
C30H32N6O3
Mol. Mass.:
524.6135
SMILES:
Nc1n[nH]c(=O)c2n(cc(-c3ccc(Oc4ccccc4)cc3)c12)[C@@H]1CCCN(C1)C(=O)\C=C\CNC1CC1
: