Target
Tyrosine-protein kinase BTK
Ligand
BDBM390068
Substrate
Meas. Tech.
Btk Kinase Assay
IC50
505±n/a nM
Citation
 Liu, DZhang, MHu, Q Aminopyridazinone compounds as protein kinase inhibitors US Patent  US10323037 Publication Date 6/18/2019 
Target
Name:
Tyrosine-protein kinase BTK
Synonyms:
AGMX1 Agammaglobulinaemia tyrosine kinase B cell progenitor kinase BPK BTK_HUMAN Tyrosine Kinase BTK Tyrosine-protein kinase BTK (BTK)
Type:
Enzyme
Mol. Mass.:
76289.95
Organism:
Homo sapiens (Human)
Description:
Q06187
Residue:
659
  
Inhibitor
Name:
BDBM390068
Synonyms:
US10323037, Example 81 | US9951077, 81
Type:
Small organic molecule
Emp. Form.:
C26H24FN5O3
Mol. Mass.:
473.4989
SMILES:
Nc1n[nH]c(=O)c2n([C@@H]3CCCN(C3)C(=O)C=C)c(F)c(-c3ccc(Oc4ccccc4)cc3)c12
: